Reaction Details
Target5-hydroxytryptamine receptor 1A
LigandBDBM50207115
Substrate/Competitorn/a
Meas. Tech.ChEMBL_1630051 (CHEMBL3872757)
Ki 3.9±n/a nM
Citation Chen, XWSun, YYFu, LLi, JQ Synthesis and pharmacological characterization of novel N-(trans-4-(2-(4-(benzo[d]isothiazol-3-yl)piperazin-1-yl)ethyl)cyclohexyl)amides as potential multireceptor atypical antipsychotics. Eur J Med Chem123:332-353 (2016) 
 
5-hydroxytryptamine receptor 1A
Name:5-hydroxytryptamine receptor 1A
Type:n/a
Mol. Mass.:46122.49
Organism:Homo sapiens (Human)
Description:n/a
Residue:422
BDBM50207115
NameBDBM50207115
Synonyms:CHEMBL3948056
TypeSmall organic molecule
Emp. Form.C26H34N4O2S2
Mol. Mass.498.704
SMILESCc1ccc(cc1)S(=O)(=O)N[C@H]1CC[C@H](CCN2CCN(CC2)c2nsc3ccccc23)CC1