Reaction Details
TargetD(3) dopamine receptor
LigandBDBM50207146
Substrate/Competitorn/a
Meas. Tech.ChEMBL_1630050 (CHEMBL3872756)
Ki 0.190000±n/a nM
Citation Chen, XWSun, YYFu, LLi, JQ Synthesis and pharmacological characterization of novel N-(trans-4-(2-(4-(benzo[d]isothiazol-3-yl)piperazin-1-yl)ethyl)cyclohexyl)amides as potential multireceptor atypical antipsychotics. Eur J Med Chem123:332-353 (2016) 
 
D(3) dopamine receptor
Name:D(3) dopamine receptor
Type:n/a
Mol. Mass.:44243.43
Organism:Homo sapiens (Human)
Description:n/a
Residue:400
BDBM50207146
NameBDBM50207146
Synonyms:CHEMBL3929168
TypeSmall organic molecule
Emp. Form.C26H38N4OS
Mol. Mass.454.671
SMILESO=C(N[C@H]1CC[C@H](CCN2CCN(CC2)c2nsc3ccccc23)CC1)C1CCCCC1