Reaction Details
Target5-hydroxytryptamine receptor 1A
LigandBDBM50207145
Substrate/Competitorn/a
Meas. Tech.ChEMBL_1630077 (CHEMBL3872783)
IC50 46±n/a nM
Citation Chen, XWSun, YYFu, LLi, JQ Synthesis and pharmacological characterization of novel N-(trans-4-(2-(4-(benzo[d]isothiazol-3-yl)piperazin-1-yl)ethyl)cyclohexyl)amides as potential multireceptor atypical antipsychotics. Eur J Med Chem123:332-353 (2016) 
 
5-hydroxytryptamine receptor 1A
Name:5-hydroxytryptamine receptor 1A
Type:n/a
Mol. Mass.:46122.49
Organism:Homo sapiens (Human)
Description:n/a
Residue:422
BDBM50207145
NameBDBM50207145
Synonyms:CHEMBL3946995 | US9550741, I-1
TypeSmall organic molecule
Emp. Form.C24H30N4O2S
Mol. Mass.438.586
SMILESO=C(N[C@H]1CC[C@H](CCN2CCN(CC2)c2nsc3ccccc23)CC1)c1ccco1