Reaction Details
TargetGlycogen phosphorylase, muscle form
LigandBDBM50148915
Substrate/Competitorn/a
Meas. Tech.ChEMBL_1630550 (CHEMBL3873256)
Ki 226±n/a nM
Citation Kantsadi, ALBokor, ÉKun, SStravodimos, GAChatzileontiadou, DSMLeonidas, DDJuhász-Tóth, ÉSzakács, ABatta, GDocsa, TGergely, PSomsák, L Synthetic, enzyme kinetic, and protein crystallographic studies of C-ß-d-glucopyranosyl pyrroles and imidazoles reveal and explain low nanomolar inhibition of human liver glycogen phosphorylase. Eur J Med Chem123:737-745 (2016) 
 
Glycogen phosphorylase, muscle form
Name:Glycogen phosphorylase, muscle form
Type:Enzyme
Mol. Mass.:97296.32
Organism:Oryctolagus cuniculus (rabbit)
Description:Phosphorylation of Ser-15 converts phosphorylase B (unphosphorylated) to phosphorylase A.
Residue:843
BDBM50148915
NameBDBM50148915
Synonyms:CHEMBL3770514
TypeSmall organic molecule
Emp. Form.C15H18N2O5
Mol. Mass.306.3138
SMILESOC[C@H]1O[C@H]([C@H](O)[C@@H](O)[C@@H]1O)c1nc(c[nH]1)-c1ccccc1