Reaction Details
TargetCannabinoid receptor 2
LigandBDBM50207239
Substrate/Competitorn/a
Meas. Tech.ChEMBL_1630568 (CHEMBL3873274)
Ki 300±n/a nM
Citation Romero-Parra, JMella-Raipán, JPalmieri, VAllarà, MTorres, MJPessoa-Mahana, HIturriaga-Vásquez, PEscobar, RFaúndez, MDi Marzo, VPessoa-Mahana, CD Synthesis, binding assays, cytotoxic activity and docking studies of benzimidazole and benzothiophene derivatives with selective affinity for the CB2 cannabinoid receptor. Eur J Med Chem124:17-35 (2016) 
 
Cannabinoid receptor 2
Name:Cannabinoid receptor 2
Type:G Protein-Coupled Receptor (GPCR)
Mol. Mass.:39690.94
Organism:Homo sapiens (Human)
Description:P34972
Residue:360
BDBM50207239
NameBDBM50207239
Synonyms:CHEMBL3907898
TypeSmall organic molecule
Emp. Form.C19H18O2S
Mol. Mass.310.41
SMILESCCCc1sc2ccccc2c1C(=O)c1ccc(OC)cc1