Reaction Details
TargetCannabinoid receptor 2
LigandBDBM50207271
Substrate/Competitorn/a
Meas. Tech.ChEMBL_1630568 (CHEMBL3873274)
IC50 400±n/a nM
Citation Romero-Parra, JMella-Raipán, JPalmieri, VAllarà, MTorres, MJPessoa-Mahana, HIturriaga-Vásquez, PEscobar, RFaúndez, MDi Marzo, VPessoa-Mahana, CD Synthesis, binding assays, cytotoxic activity and docking studies of benzimidazole and benzothiophene derivatives with selective affinity for the CB2 cannabinoid receptor. Eur J Med Chem124:17-35 (2016) 
 
Cannabinoid receptor 2
Name:Cannabinoid receptor 2
Type:G Protein-Coupled Receptor (GPCR)
Mol. Mass.:39690.94
Organism:Homo sapiens (Human)
Description:P34972
Residue:360
BDBM50207271
NameBDBM50207271
Synonyms:CHEMBL594935
TypeSmall organic molecule
Emp. Form.C23H18O3S
Mol. Mass.374.452
SMILESCOc1ccc(cc1)C(=O)c1c(sc2ccccc12)-c1ccc(OC)cc1