Reaction Details
TargetCannabinoid receptor 1
LigandBDBM50207269
Substrate/Competitorn/a
Meas. Tech.ChEMBL_1630565 (CHEMBL3873271)
Ki 5100±n/a nM
Citation Romero-Parra, JMella-Raipán, JPalmieri, VAllarà, MTorres, MJPessoa-Mahana, HIturriaga-Vásquez, PEscobar, RFaúndez, MDi Marzo, VPessoa-Mahana, CD Synthesis, binding assays, cytotoxic activity and docking studies of benzimidazole and benzothiophene derivatives with selective affinity for the CB2 cannabinoid receptor. Eur J Med Chem124:17-35 (2016) 
 
Cannabinoid receptor 1
Name:Cannabinoid receptor 1
Type:G Protein-Coupled Receptor (GPCR)
Mol. Mass.:52868.96
Organism:Homo sapiens (Human)
Description:P21554
Residue:472
BDBM50207269
NameBDBM50207269
Synonyms:CHEMBL3907434
TypeSmall organic molecule
Emp. Form.C26H18O2S
Mol. Mass.394.485
SMILESCOc1ccc(cc1)-c1sc2ccccc2c1C(=O)c1cccc2ccccc12