Reaction Details
TargetCannabinoid receptor 2
LigandBDBM50207241
Substrate/Competitorn/a
Meas. Tech.ChEMBL_1630568 (CHEMBL3873274)
Ki 800±n/a nM
Citation Romero-Parra, JMella-Raipán, JPalmieri, VAllarà, MTorres, MJPessoa-Mahana, HIturriaga-Vásquez, PEscobar, RFaúndez, MDi Marzo, VPessoa-Mahana, CD Synthesis, binding assays, cytotoxic activity and docking studies of benzimidazole and benzothiophene derivatives with selective affinity for the CB2 cannabinoid receptor. Eur J Med Chem124:17-35 (2016) 
 
Cannabinoid receptor 2
Name:Cannabinoid receptor 2
Type:G Protein-Coupled Receptor (GPCR)
Mol. Mass.:39690.94
Organism:Homo sapiens (Human)
Description:P34972
Residue:360
BDBM50207241
NameBDBM50207241
Synonyms:CHEMBL3895577
TypeSmall organic molecule
Emp. Form.C18H18N2O2
Mol. Mass.294.3477
SMILESCOc1ccc(cc1)C(=O)n1c(nc2ccccc12)C(C)C