Reaction Details
TargetCannabinoid receptor 2
LigandBDBM50207252
Substrate/Competitorn/a
Meas. Tech.ChEMBL_1630568 (CHEMBL3873274)
Ki 1600±n/a nM
Citation Romero-Parra, JMella-Raipán, JPalmieri, VAllarà, MTorres, MJPessoa-Mahana, HIturriaga-Vásquez, PEscobar, RFaúndez, MDi Marzo, VPessoa-Mahana, CD Synthesis, binding assays, cytotoxic activity and docking studies of benzimidazole and benzothiophene derivatives with selective affinity for the CB2 cannabinoid receptor. Eur J Med Chem124:17-35 (2016) 
 
Cannabinoid receptor 2
Name:Cannabinoid receptor 2
Type:G Protein-Coupled Receptor (GPCR)
Mol. Mass.:39690.94
Organism:Homo sapiens (Human)
Description:P34972
Residue:360
BDBM50207252
NameBDBM50207252
Synonyms:CHEMBL3935866
TypeSmall organic molecule
Emp. Form.C18H16O2S
Mol. Mass.296.383
SMILESCCc1sc2ccccc2c1C(=O)c1ccc(OC)cc1