Reaction Details
TargetCannabinoid receptor 1
LigandBDBM50207247
Substrate/Competitorn/a
Meas. Tech.ChEMBL_1630565 (CHEMBL3873271)
Ki 5900±n/a nM
Citation Romero-Parra, JMella-Raipán, JPalmieri, VAllarà, MTorres, MJPessoa-Mahana, HIturriaga-Vásquez, PEscobar, RFaúndez, MDi Marzo, VPessoa-Mahana, CD Synthesis, binding assays, cytotoxic activity and docking studies of benzimidazole and benzothiophene derivatives with selective affinity for the CB2 cannabinoid receptor. Eur J Med Chem124:17-35 (2016) 
 
Cannabinoid receptor 1
Name:Cannabinoid receptor 1
Type:G Protein-Coupled Receptor (GPCR)
Mol. Mass.:52868.96
Organism:Homo sapiens (Human)
Description:P21554
Residue:472
BDBM50207247
NameBDBM50207247
Synonyms:CHEMBL3920181
TypeSmall organic molecule
Emp. Form.C22H20N2O
Mol. Mass.328.407
SMILESCCCCc1nc2ccccc2n1C(=O)c1cccc2ccccc12