Reaction Details
TargetCannabinoid receptor 1
LigandBDBM50207262
Substrate/Competitorn/a
Meas. Tech.ChEMBL_1630565 (CHEMBL3873271)
Ki>10000±n/a nM
Citation Romero-Parra, JMella-Raipán, JPalmieri, VAllarà, MTorres, MJPessoa-Mahana, HIturriaga-Vásquez, PEscobar, RFaúndez, MDi Marzo, VPessoa-Mahana, CD Synthesis, binding assays, cytotoxic activity and docking studies of benzimidazole and benzothiophene derivatives with selective affinity for the CB2 cannabinoid receptor. Eur J Med Chem124:17-35 (2016) 
 
Cannabinoid receptor 1
Name:Cannabinoid receptor 1
Type:G Protein-Coupled Receptor (GPCR)
Mol. Mass.:52868.96
Organism:Homo sapiens (Human)
Description:P21554
Residue:472
BDBM50207262
NameBDBM50207262
Synonyms:CHEMBL3898880
TypeSmall organic molecule
Emp. Form.C19H18N2O2
Mol. Mass.306.3584
SMILESCOc1ccc(cc1)C(=O)n1c(nc2ccccc12)C1CCC1