Reaction Details
TargetLysozyme C
LigandBDBM50207301
Substrate/Competitorn/a
Meas. Tech.ChEMBL_1630606 (CHEMBL3873312)
pH2.5±n/a
IC50 12300±n/a nM
Commentsextracted
Citation Ramshini, HMannini, BKhodayari, KEbrahim-Habibi, AMoghaddasi, ASTayebee, RChiti, F Bis(indolyl)phenylmethane derivatives are effective small molecules for inhibition of amyloid fibril formation by hen lysozyme. Eur J Med Chem124:361-371 (2016) 
 
Lysozyme C
Name:Lysozyme C
Type:Enzyme
Mol. Mass.:16248.07
Organism:Gallus gallus (chicken)
Description:P00698
Residue:147
BDBM50207301
NameBDBM50207301
Synonyms:CHEMBL3928463
TypeSmall organic molecule
Emp. Form.C23H18N2
Mol. Mass.322.4024
SMILESc1cc2ccccc2n1C(c1ccccc1)n1ccc2ccccc12