Reaction Details
TargetProstaglandin E synthase
LigandBDBM50207335
Substrate/Competitorn/a
Meas. Tech.ChEMBL_1630871 (CHEMBL3873577)
IC50 3.2±n/a nM
Citation Muthukaman, NDeshmukh, SSarode, NTondlekar, STambe, MPisal, DShaikh, MKattige, VGHonnegowda, SKarande, VKulkarni, AJadhav, SBMahat, MYAGudi, GSKhairatkar-Joshi, NGharat, LA Discovery of 2-((2-chloro-6-fluorophenyl)amino)-N-(3-fluoro-5-(trifluoromethyl)phenyl)-1-methyl-7,8-dihydro-1H-[1,4]dioxino[2',3':3,4]benzo[1,2-d]imidazole-5-carboxamide as potent, selective and efficacious microsomal prostaglandin E Bioorg Med Chem Lett26:5977-5984 (2016) 
 
Prostaglandin E synthase
Name:Prostaglandin E synthase
Type:Protein
Mol. Mass.:17112.22
Organism:Homo sapiens (Human)
Description:n/a
Residue:152
BDBM50207335
NameBDBM50207335
Synonyms:CHEMBL3961834
TypeSmall organic molecule
Emp. Form.C26H21ClF4N4O2
Mol. Mass.532.917
SMILESCn1c(Nc2c(F)cccc2Cl)nc2cc(C(=O)Nc3ccc(cc3)C(F)(F)F)c3OC(C)(C)Cc3c12