Reaction Details
TargetProstaglandin E synthase
LigandBDBM50227631
Substrate/Competitorn/a
Meas. Tech.ChEMBL_1630871 (CHEMBL3873577)
IC50 1.9±n/a nM
Citation Muthukaman, NDeshmukh, SSarode, NTondlekar, STambe, MPisal, DShaikh, MKattige, VGHonnegowda, SKarande, VKulkarni, AJadhav, SBMahat, MYAGudi, GSKhairatkar-Joshi, NGharat, LA Discovery of 2-((2-chloro-6-fluorophenyl)amino)-N-(3-fluoro-5-(trifluoromethyl)phenyl)-1-methyl-7,8-dihydro-1H-[1,4]dioxino[2',3':3,4]benzo[1,2-d]imidazole-5-carboxamide as potent, selective and efficacious microsomal prostaglandin E Bioorg Med Chem Lett26:5977-5984 (2016) 
 
Prostaglandin E synthase
Name:Prostaglandin E synthase
Type:Protein
Mol. Mass.:17112.22
Organism:Homo sapiens (Human)
Description:n/a
Residue:152
BDBM50227631
NameBDBM50227631
Synonyms:2-(6-chloro-1H-phenanthro[9,10-d]imidazol-2-yl)isophthalonitrile | CHEMBL412099
TypeSmall organic molecule
Emp. Form.C23H11ClN4
Mol. Mass.378.813
SMILESClc1ccc2c3[nH]c(nc3c3ccccc3c2c1)-c1c(cccc1C#N)C#N