Reaction Details
TargetProtein-tyrosine kinase 2-beta
LigandBDBM50207348
Substrate/Competitorn/a
Meas. Tech.ChEMBL_1630970 (CHEMBL3873676)
IC50 3.5±n/a nM
Citation Farand, JMai, NChandrasekhar, JNewby, ZEVan Veldhuizen, JLoyer-Drew, JVenkataramani, CGuerrero, JKwok, ALi, NZherebina, YWilbert, SZablocki, JPhillips, GWatkins, WJMourey, RNotte, GT Selectivity switch between FAK and Pyk2: Macrocyclization of FAK inhibitors improves Pyk2 potency. Bioorg Med Chem Lett26:5926-5930 (2016) 
 
Protein-tyrosine kinase 2-beta
Name:Protein-tyrosine kinase 2-beta
Type:Protein
Mol. Mass.:115868.80
Organism:Homo sapiens (Human)
Description:Q14289
Residue:1009
BDBM50207348
NameBDBM50207348
Synonyms:CHEMBL3912281
TypeSmall organic molecule
Emp. Form.C23H22F3N7O3S
Mol. Mass.533.526
SMILESFC(F)(F)c1cnc2Nc3ccc4N(CCc4c3)C(=O)CCCNS(=O)(=O)c3ncccc3CNc1n2