Reaction Details
TargetProtein-tyrosine kinase 2-beta
LigandBDBM50207350
Substrate/Competitorn/a
Meas. Tech.ChEMBL_1630970 (CHEMBL3873676)
IC50 0.900000±n/a nM
Citation Farand, JMai, NChandrasekhar, JNewby, ZEVan Veldhuizen, JLoyer-Drew, JVenkataramani, CGuerrero, JKwok, ALi, NZherebina, YWilbert, SZablocki, JPhillips, GWatkins, WJMourey, RNotte, GT Selectivity switch between FAK and Pyk2: Macrocyclization of FAK inhibitors improves Pyk2 potency. Bioorg Med Chem Lett26:5926-5930 (2016) 
 
Protein-tyrosine kinase 2-beta
Name:Protein-tyrosine kinase 2-beta
Type:Protein
Mol. Mass.:115868.80
Organism:Homo sapiens (Human)
Description:Q14289
Residue:1009
BDBM50207350
NameBDBM50207350
Synonyms:CHEMBL3956954
TypeSmall organic molecule
Emp. Form.C26H27F3N6O3S
Mol. Mass.560.591
SMILESCS(=O)(=O)N1CCCCC(=O)N2CCc3cc(Nc4ncc(c(NCc5ccccc15)n4)C(F)(F)F)ccc23