Reaction Details
TargetProtein-tyrosine kinase 2-beta
LigandBDBM50207353
Substrate/Competitorn/a
Meas. Tech.ChEMBL_1630970 (CHEMBL3873676)
IC50 0.670000±n/a nM
Citation Farand, JMai, NChandrasekhar, JNewby, ZEVan Veldhuizen, JLoyer-Drew, JVenkataramani, CGuerrero, JKwok, ALi, NZherebina, YWilbert, SZablocki, JPhillips, GWatkins, WJMourey, RNotte, GT Selectivity switch between FAK and Pyk2: Macrocyclization of FAK inhibitors improves Pyk2 potency. Bioorg Med Chem Lett26:5926-5930 (2016) 
 
Protein-tyrosine kinase 2-beta
Name:Protein-tyrosine kinase 2-beta
Type:Protein
Mol. Mass.:115868.80
Organism:Homo sapiens (Human)
Description:Q14289
Residue:1009
BDBM50207353
NameBDBM50207353
Synonyms:CHEMBL3949755
TypeSmall organic molecule
Emp. Form.C21H21F3N6O2S
Mol. Mass.478.491
SMILESCS(=O)(=O)N1CCCc2cccc(Nc3ncc(c(NCc4cccnc14)n3)C(F)(F)F)c2