Reaction Details
TargetProtein-tyrosine kinase 2-beta
LigandBDBM50207360
Substrate/Competitorn/a
Meas. Tech.ChEMBL_1630970 (CHEMBL3873676)
IC50 201±n/a nM
Citation Farand, JMai, NChandrasekhar, JNewby, ZEVan Veldhuizen, JLoyer-Drew, JVenkataramani, CGuerrero, JKwok, ALi, NZherebina, YWilbert, SZablocki, JPhillips, GWatkins, WJMourey, RNotte, GT Selectivity switch between FAK and Pyk2: Macrocyclization of FAK inhibitors improves Pyk2 potency. Bioorg Med Chem Lett26:5926-5930 (2016) 
 
Protein-tyrosine kinase 2-beta
Name:Protein-tyrosine kinase 2-beta
Type:Protein
Mol. Mass.:115868.80
Organism:Homo sapiens (Human)
Description:Q14289
Residue:1009
BDBM50207360
NameBDBM50207360
Synonyms:CHEMBL3927099
TypeSmall organic molecule
Emp. Form.C27H31F3N6O4S
Mol. Mass.592.633
SMILESCN(Cc1ccccc1N(CCCCC(O)=O)S(C)(=O)=O)c1nc(Nc2ccc3NCCc3c2)ncc1C(F)(F)F