Reaction Details
TargetFocal adhesion kinase 1
LigandBDBM50207357
Substrate/Competitorn/a
Meas. Tech.ChEMBL_1630971 (CHEMBL3873677)
IC50 21±n/a nM
Citation Farand, JMai, NChandrasekhar, JNewby, ZEVan Veldhuizen, JLoyer-Drew, JVenkataramani, CGuerrero, JKwok, ALi, NZherebina, YWilbert, SZablocki, JPhillips, GWatkins, WJMourey, RNotte, GT Selectivity switch between FAK and Pyk2: Macrocyclization of FAK inhibitors improves Pyk2 potency. Bioorg Med Chem Lett26:5926-5930 (2016) 
 
Focal adhesion kinase 1
Name:Focal adhesion kinase 1
Type:Tyrosine-protein kinase
Mol. Mass.:119233.17
Organism:Homo sapiens (Human)
Description:Q05397
Residue:1052
BDBM50207357
NameBDBM50207357
Synonyms:CHEMBL3939286
TypeSmall organic molecule
Emp. Form.C28H24F3N7O3S
Mol. Mass.595.595
SMILESCS(=O)(=O)N1Cc2cccc(c2)C(=O)N2CCc3cc(Nc4ncc(c(NCc5cccnc15)n4)C(F)(F)F)ccc23