Reaction Details
TargetProtein-tyrosine kinase 2-beta
LigandBDBM50207351
Substrate/Competitorn/a
Meas. Tech.ChEMBL_1630970 (CHEMBL3873676)
IC50 20±n/a nM
Citation Farand, JMai, NChandrasekhar, JNewby, ZEVan Veldhuizen, JLoyer-Drew, JVenkataramani, CGuerrero, JKwok, ALi, NZherebina, YWilbert, SZablocki, JPhillips, GWatkins, WJMourey, RNotte, GT Selectivity switch between FAK and Pyk2: Macrocyclization of FAK inhibitors improves Pyk2 potency. Bioorg Med Chem Lett26:5926-5930 (2016) 
 
Protein-tyrosine kinase 2-beta
Name:Protein-tyrosine kinase 2-beta
Type:Protein
Mol. Mass.:115868.80
Organism:Homo sapiens (Human)
Description:Q14289
Residue:1009
BDBM50207351
NameBDBM50207351
Synonyms:CHEMBL3965256
TypeSmall organic molecule
Emp. Form.C25H27BrF3N7O3S
Mol. Mass.642.491
SMILESCS(=O)(=O)N(CC=C)c1ncccc1CNc1nc(Nc2ccc(N3CCOCC3)c(Br)c2)ncc1C(F)(F)F