Reaction Details
Target5-hydroxytryptamine receptor 5A
LigandBDBM50207400
Substrate/Competitorn/a
Meas. Tech.ChEMBL_1631229 (CHEMBL3873935)
Ki>6900000±n/a nM
Citation Blanco, MJBenesh, DRKnobelsdorf, JAKhilevich, ACortez, GSMokube, FAicher, TDGroendyke, TMMarmsater, FPTang, TPJohnson, KWClemens-Smith, AMuhlhauser, MASwanson, SCatlow, JEmkey, RJohnson, MPSchkeryantz, JM Discovery of dual positive allosteric modulators (PAMs) of the metabotropic glutamate 2 receptor and CysLT1 antagonists for treating migraine headache. Bioorg Med Chem Lett27:323-328 (2017) 
 
5-hydroxytryptamine receptor 5A
Name:5-hydroxytryptamine receptor 5A
Type:Enzyme
Mol. Mass.:40266.25
Organism:Homo sapiens (Human)
Description:P47898
Residue:357
BDBM50207400
NameBDBM50207400
Synonyms:CHEMBL3899832
TypeSmall organic molecule
Emp. Form.C22H19N5O4
Mol. Mass.417.4174
SMILESCC(=O)c1ccc(OCc2ccc(Oc3cc(ccn3)-c3nn[nH]n3)cc2)c(C)c1O