Reaction Details
TargetCysteinyl leukotriene receptor 1
LigandBDBM50207413
Substrate/Competitorn/a
Meas. Tech.ChEMBL_1631170 (CHEMBL3873876)
IC50 330±n/a nM
Citation Blanco, MJBenesh, DRKnobelsdorf, JAKhilevich, ACortez, GSMokube, FAicher, TDGroendyke, TMMarmsater, FPTang, TPJohnson, KWClemens-Smith, AMuhlhauser, MASwanson, SCatlow, JEmkey, RJohnson, MPSchkeryantz, JM Discovery of dual positive allosteric modulators (PAMs) of the metabotropic glutamate 2 receptor and CysLT1 antagonists for treating migraine headache. Bioorg Med Chem Lett27:323-328 (2017) 
 
Cysteinyl leukotriene receptor 1
Name:Cysteinyl leukotriene receptor 1
Type:Enzyme Catalytic Domain
Mol. Mass.:38565.16
Organism:Homo sapiens (Human)
Description:Leukotriene Cysteinyl 1 CYSLTR1 HUMAN::Q9Y271
Residue:337
BDBM50207413
NameBDBM50207413
Synonyms:CHEMBL3945882
TypeSmall organic molecule
Emp. Form.C24H23N5O4
Mol. Mass.445.4705
SMILESCCCc1c(OCc2ccc(Oc3ncccc3-c3nn[nH]n3)cc2)ccc(C(C)=O)c1O