Reaction Details
TargetMuscarinic acetylcholine receptor M1
LigandBDBM50207517
Substrate/Competitorn/a
Meas. Tech.ChEMBL_1632009 (CHEMBL3874715)
EC50>30000±n/a nM
Citation Wood, MRNoetzel, MJPoslusney, MSMelancon, BJTarr, JCLamsal, AChang, SLuscombe, VBWeiner, RLCho, HPBubser, MJones, CKNiswender, CMWood, MWEngers, DWBrandon, NJDuggan, MEConn, PJBridges, TMLindsley, CW Challenges in the development of an M Bioorg Med Chem Lett27:171-175 (2017) 
 
Muscarinic acetylcholine receptor M1
Name:Muscarinic acetylcholine receptor M1
Type:Protein
Mol. Mass.:51442.54
Organism:Homo sapiens (Human)
Description:P11229
Residue:460
BDBM50207517
NameBDBM50207517
Synonyms:CHEMBL3915634
TypeSmall organic molecule
Emp. Form.C17H15F3N4O3S2
Mol. Mass.444.451
SMILESCc1nnc2sc(C(=O)NCc3ccc(cc3)S(=O)(=O)C(F)(F)F)c(N)c2c1C