Reaction Details
TargetCytochrome P450 2D6
LigandBDBM50207517
Substrate/Competitorn/a
Meas. Tech.ChEMBL_1631998 (CHEMBL3874704)
IC50>30000±n/a nM
Citation Wood, MRNoetzel, MJPoslusney, MSMelancon, BJTarr, JCLamsal, AChang, SLuscombe, VBWeiner, RLCho, HPBubser, MJones, CKNiswender, CMWood, MWEngers, DWBrandon, NJDuggan, MEConn, PJBridges, TMLindsley, CW Challenges in the development of an M Bioorg Med Chem Lett27:171-175 (2017) 
 
Cytochrome P450 2D6
Name:Cytochrome P450 2D6
Type:Protein
Mol. Mass.:55774.82
Organism:Homo sapiens (Human)
Description:P10635
Residue:497
BDBM50207517
NameBDBM50207517
Synonyms:CHEMBL3915634
TypeSmall organic molecule
Emp. Form.C17H15F3N4O3S2
Mol. Mass.444.451
SMILESCc1nnc2sc(C(=O)NCc3ccc(cc3)S(=O)(=O)C(F)(F)F)c(N)c2c1C