Reaction Details
TargetMuscarinic acetylcholine receptor M3
LigandBDBM50207517
Substrate/Competitorn/a
Meas. Tech.ChEMBL_1632011 (CHEMBL3874717)
EC50>30000±n/a nM
Citation Wood, MRNoetzel, MJPoslusney, MSMelancon, BJTarr, JCLamsal, AChang, SLuscombe, VBWeiner, RLCho, HPBubser, MJones, CKNiswender, CMWood, MWEngers, DWBrandon, NJDuggan, MEConn, PJBridges, TMLindsley, CW Challenges in the development of an M Bioorg Med Chem Lett27:171-175 (2017) 
 
Muscarinic acetylcholine receptor M3
Name:Muscarinic acetylcholine receptor M3
Type:Enzyme
Mol. Mass.:66151.03
Organism:Homo sapiens (Human)
Description:P20309
Residue:590
BDBM50207517
NameBDBM50207517
Synonyms:CHEMBL3915634
TypeSmall organic molecule
Emp. Form.C17H15F3N4O3S2
Mol. Mass.444.451
SMILESCc1nnc2sc(C(=O)NCc3ccc(cc3)S(=O)(=O)C(F)(F)F)c(N)c2c1C