Reaction Details
TargetCytochrome P450 1A2
LigandBDBM50207463
Substrate/Competitorn/a
Meas. Tech.ChEMBL_1631996 (CHEMBL3874702)
IC50>30000±n/a nM
Citation Wood, MRNoetzel, MJPoslusney, MSMelancon, BJTarr, JCLamsal, AChang, SLuscombe, VBWeiner, RLCho, HPBubser, MJones, CKNiswender, CMWood, MWEngers, DWBrandon, NJDuggan, MEConn, PJBridges, TMLindsley, CW Challenges in the development of an M Bioorg Med Chem Lett27:171-175 (2017) 
 
Cytochrome P450 1A2
Name:Cytochrome P450 1A2
Type:Enzyme
Mol. Mass.:58423.38
Organism:Homo sapiens (Human)
Description:P05177
Residue:516
BDBM50207463
NameBDBM50207463
Synonyms:CHEMBL3963788
TypeSmall organic molecule
Emp. Form.C17H16F2N4O3S2
Mol. Mass.426.461
SMILESCc1nnc2sc(C(=O)NCc3ccc(cc3)S(=O)(=O)C(F)F)c(N)c2c1C