Reaction Details
TargetMuscarinic acetylcholine receptor M4
LigandBDBM50207517
Substrate/Competitorn/a
Meas. Tech.ChEMBL_1631985 (CHEMBL3874691)
EC50 18±n/a nM
Citation Wood, MRNoetzel, MJPoslusney, MSMelancon, BJTarr, JCLamsal, AChang, SLuscombe, VBWeiner, RLCho, HPBubser, MJones, CKNiswender, CMWood, MWEngers, DWBrandon, NJDuggan, MEConn, PJBridges, TMLindsley, CW Challenges in the development of an M Bioorg Med Chem Lett27:171-175 (2017) 
 
Muscarinic acetylcholine receptor M4
Name:Muscarinic acetylcholine receptor M4
Type:Enzyme Catalytic Domain
Mol. Mass.:52841.70
Organism:RAT
Description:Cholinergic, muscarinic M4 CHRM4 RAT::P08485
Residue:477
BDBM50207517
NameBDBM50207517
Synonyms:CHEMBL3915634
TypeSmall organic molecule
Emp. Form.C17H15F3N4O3S2
Mol. Mass.444.451
SMILESCc1nnc2sc(C(=O)NCc3ccc(cc3)S(=O)(=O)C(F)(F)F)c(N)c2c1C