Reaction Details
TargetMuscarinic acetylcholine receptor M2
LigandBDBM50207516
Substrate/Competitorn/a
Meas. Tech.ChEMBL_1632010 (CHEMBL3874716)
EC50>30000±n/a nM
Citation Wood, MRNoetzel, MJPoslusney, MSMelancon, BJTarr, JCLamsal, AChang, SLuscombe, VBWeiner, RLCho, HPBubser, MJones, CKNiswender, CMWood, MWEngers, DWBrandon, NJDuggan, MEConn, PJBridges, TMLindsley, CW Challenges in the development of an M Bioorg Med Chem Lett27:171-175 (2017) 
 
Muscarinic acetylcholine receptor M2
Name:Muscarinic acetylcholine receptor M2
Type:GPCR
Mol. Mass.:51730.61
Organism:Homo sapiens (Human)
Description:P08172
Residue:466
BDBM50207516
NameBDBM50207516
Synonyms:CHEMBL3942511
TypeSmall organic molecule
Emp. Form.C16H15F5N4OS2
Mol. Mass.438.439
SMILESCc1nnc2sc(C(=O)NCc3ccc(cc3)S(F)(F)(F)(F)F)c(N)c2c1C