Reaction Details
TargetCarbonic anhydrase 9
LigandBDBM50207541
Substrate/Competitorn/a
Meas. Tech.ChEMBL_1632054 (CHEMBL3874760)
Ki 349±n/a nM
Citation Bozdag, MAlafeefy, AMAltamimi, AMVullo, DCarta, FSupuran, CT Coumarins and other fused bicyclic heterocycles with selective tumor-associated carbonic anhydrase isoforms inhibitory activity. Bioorg Med Chem25:677-683 (2017) 
 
Carbonic anhydrase 9
Name:Carbonic anhydrase 9
Type:Enzyme
Mol. Mass.:49669.03
Organism:Homo sapiens (Human)
Description:Catalytic domain of human cloned isozyme was used in the assay
Residue:459
BDBM50207541
NameBDBM50207541
Synonyms:CHEMBL1993421
TypeSmall organic molecule
Emp. Form.C8H8N2O2S
Mol. Mass.196.226
SMILESCC1=Nc2ccccc2S(=O)(=O)N1