Reaction Details
TargetCarbonic anhydrase 12
LigandBDBM50207543
Substrate/Competitorn/a
Meas. Tech.ChEMBL_1632055 (CHEMBL3874761)
Ki 10±n/a nM
Citation Bozdag, MAlafeefy, AMAltamimi, AMVullo, DCarta, FSupuran, CT Coumarins and other fused bicyclic heterocycles with selective tumor-associated carbonic anhydrase isoforms inhibitory activity. Bioorg Med Chem25:677-683 (2017) 
 
Carbonic anhydrase 12
Name:Carbonic anhydrase 12
Type:Enzyme
Mol. Mass.:39456.00
Organism:Homo sapiens (Human)
Description:Catalytic domain of human cloned isozyme was used in the assay
Residue:354
BDBM50207543
NameBDBM50207543
Synonyms:CHEMBL3956977
TypeSmall organic molecule
Emp. Form.C24H17FN2O4
Mol. Mass.416.4012
SMILESCc1cc(=O)oc2cc(NC(=O)c3ccccc3NC(=O)c3ccc(F)cc3)ccc12