Reaction Details
TargetCarbonic anhydrase 2
LigandBDBM50207545
Substrate/Competitorn/a
Meas. Tech.ChEMBL_1632053 (CHEMBL3874759)
Ki>500000±n/a nM
Citation Bozdag, MAlafeefy, AMAltamimi, AMVullo, DCarta, FSupuran, CT Coumarins and other fused bicyclic heterocycles with selective tumor-associated carbonic anhydrase isoforms inhibitory activity. Bioorg Med Chem25:677-683 (2017) 
 
Carbonic anhydrase 2
Name:Carbonic anhydrase 2
Type:Enzyme
Mol. Mass.:29250.71
Organism:Homo sapiens (Human)
Description:P00918
Residue:260
BDBM50207545
NameBDBM50207545
Synonyms:CHEMBL3914224
TypeSmall organic molecule
Emp. Form.C8H5N3O4
Mol. Mass.207.143
SMILES[O-][N+](=O)c1ccc2[nH]c(=O)[nH]c(=O)c2c1