Reaction Details
TargetHepatocyte growth factor receptor
LigandBDBM50399540
Substrate/Competitorn/a
Meas. Tech.ChEMBL_1632247 (CHEMBL3874953)
IC50 1.4±n/a nM
Citation Wang, XJiang, NZhao, SXi, SWang, JJing, TZhang, WGuo, MGong, PZhai, X Design, synthesis and biological evaluation of novel 4-(2-fluorophenoxy)quinoline derivatives as selective c-Met inhibitors. Bioorg Med Chem25:886-896 (2017) 
 
Hepatocyte growth factor receptor
Name:Hepatocyte growth factor receptor
Type:Protein
Mol. Mass.:155559.73
Organism:Homo sapiens (Human)
Description:P08581
Residue:1390
BDBM50399540
NameBDBM50399540
Synonyms:FORETINIB US10882853, Compound For-Oxide
TypeSmall organic molecule
Emp. Form.C34H34F2N4O6
Mol. Mass.632.6538
SMILESCOc1cc2c(Oc3ccc(NC(=O)C4(CC4)C(=O)Nc4ccc(F)cc4)cc3F)ccnc2cc1OCCCN1CCOCC1