Reaction Details
TargetCarbonic anhydrase 1
LigandBDBM50207738
Substrate/Competitorn/a
Meas. Tech.ChEMBL_1632257 (CHEMBL3874963)
Ki 716±n/a nM
Citation Ivanova, JBalode, A?alubovskis, RLeitans, JKazaks, AVullo, DTars, KSupuran, CT 5-Substituted-benzylsulfanyl-thiophene-2-sulfonamides with effective carbonic anhydrase inhibitory activity: Solution and crystallographic investigations. Bioorg Med Chem25:857-863 (2017) 
 
Carbonic anhydrase 1
Name:Carbonic anhydrase 1
Type:Enzyme
Mol. Mass.:28873.37
Organism:Homo sapiens (Human)
Description:P00915
Residue:261
BDBM50207738
NameBDBM50207738
Synonyms:CHEMBL3922422
TypeSmall organic molecule
Emp. Form.C12H13NO2S3
Mol. Mass.299.432
SMILESCc1ccc(CSc2ccc(s2)S(N)(=O)=O)cc1