Reaction Details
TargetCarbonic anhydrase 12
LigandBDBM50207842
Substrate/Competitorn/a
Meas. Tech.ChEMBL_1632260 (CHEMBL3874966)
Ki 13±n/a nM
Citation Ivanova, JBalode, A?alubovskis, RLeitans, JKazaks, AVullo, DTars, KSupuran, CT 5-Substituted-benzylsulfanyl-thiophene-2-sulfonamides with effective carbonic anhydrase inhibitory activity: Solution and crystallographic investigations. Bioorg Med Chem25:857-863 (2017) 
 
Carbonic anhydrase 12
Name:Carbonic anhydrase 12
Type:Enzyme
Mol. Mass.:39456.00
Organism:Homo sapiens (Human)
Description:Catalytic domain of human cloned isozyme was used in the assay
Residue:354
BDBM50207842
NameBDBM50207842
Synonyms:CHEMBL3939285
TypeSmall organic molecule
Emp. Form.C13H15NO4S3
Mol. Mass.345.458
SMILESCOc1cc(CSc2ccc(s2)S(N)(=O)=O)cc(OC)c1