Reaction Details
TargetCarbonic anhydrase 12
LigandBDBM50207818
Substrate/Competitorn/a
Meas. Tech.ChEMBL_1632260 (CHEMBL3874966)
Ki 1.5±n/a nM
Citation Ivanova, JBalode, A?alubovskis, RLeitans, JKazaks, AVullo, DTars, KSupuran, CT 5-Substituted-benzylsulfanyl-thiophene-2-sulfonamides with effective carbonic anhydrase inhibitory activity: Solution and crystallographic investigations. Bioorg Med Chem25:857-863 (2017) 
 
Carbonic anhydrase 12
Name:Carbonic anhydrase 12
Type:Enzyme
Mol. Mass.:39456.00
Organism:Homo sapiens (Human)
Description:Catalytic domain of human cloned isozyme was used in the assay
Residue:354
BDBM50207818
NameBDBM50207818
Synonyms:CHEMBL3956725
TypeSmall organic molecule
Emp. Form.C12H10F3NO2S3
Mol. Mass.353.404
SMILESNS(=O)(=O)c1ccc(SCc2ccc(cc2)C(F)(F)F)s1