Reaction Details
TargetCarbonic anhydrase 2
LigandBDBM50207815
Substrate/Competitorn/a
Meas. Tech.ChEMBL_1632258 (CHEMBL3874964)
Ki 24±n/a nM
Citation Ivanova, JBalode, A?alubovskis, RLeitans, JKazaks, AVullo, DTars, KSupuran, CT 5-Substituted-benzylsulfanyl-thiophene-2-sulfonamides with effective carbonic anhydrase inhibitory activity: Solution and crystallographic investigations. Bioorg Med Chem25:857-863 (2017) 
 
Carbonic anhydrase 2
Name:Carbonic anhydrase 2
Type:Enzyme
Mol. Mass.:29250.71
Organism:Homo sapiens (Human)
Description:P00918
Residue:260
BDBM50207815
NameBDBM50207815
Synonyms:CHEMBL3977311
TypeSmall organic molecule
Emp. Form.C15H13NO2S3
Mol. Mass.335.464
SMILESNS(=O)(=O)c1ccc(SCc2ccc3ccccc3c2)s1