Reaction Details
TargetCarbonic anhydrase 12
LigandBDBM50207820
Substrate/Competitorn/a
Meas. Tech.ChEMBL_1632260 (CHEMBL3874966)
Ki 0.820000±n/a nM
Citation Ivanova, JBalode, A?alubovskis, RLeitans, JKazaks, AVullo, DTars, KSupuran, CT 5-Substituted-benzylsulfanyl-thiophene-2-sulfonamides with effective carbonic anhydrase inhibitory activity: Solution and crystallographic investigations. Bioorg Med Chem25:857-863 (2017) 
 
Carbonic anhydrase 12
Name:Carbonic anhydrase 12
Type:Enzyme
Mol. Mass.:39456.00
Organism:Homo sapiens (Human)
Description:Catalytic domain of human cloned isozyme was used in the assay
Residue:354
BDBM50207820
NameBDBM50207820
Synonyms:CHEMBL3985384
TypeSmall organic molecule
Emp. Form.C12H10F3NO3S3
Mol. Mass.369.403
SMILESNS(=O)(=O)c1ccc(SCc2ccc(OC(F)(F)F)cc2)s1