Reaction Details
TargetCarbonic anhydrase 2
LigandBDBM50207820
Substrate/Competitorn/a
Meas. Tech.ChEMBL_1632258 (CHEMBL3874964)
Ki 5.1±n/a nM
Citation Ivanova, JBalode, A?alubovskis, RLeitans, JKazaks, AVullo, DTars, KSupuran, CT 5-Substituted-benzylsulfanyl-thiophene-2-sulfonamides with effective carbonic anhydrase inhibitory activity: Solution and crystallographic investigations. Bioorg Med Chem25:857-863 (2017) 
 
Carbonic anhydrase 2
Name:Carbonic anhydrase 2
Type:Enzyme
Mol. Mass.:29250.71
Organism:Homo sapiens (Human)
Description:P00918
Residue:260
BDBM50207820
NameBDBM50207820
Synonyms:CHEMBL3985384
TypeSmall organic molecule
Emp. Form.C12H10F3NO3S3
Mol. Mass.369.403
SMILESNS(=O)(=O)c1ccc(SCc2ccc(OC(F)(F)F)cc2)s1