Reaction Details
Target5-hydroxytryptamine receptor 6
LigandBDBM50208215
Substrate/Competitorn/a
Meas. Tech.ChEMBL_1632480 (CHEMBL3875272)
Ki 39±n/a nM
Citation Wieckowska, AKolaczkowski, MBucki, AGodyn, JMarcinkowska, MWieckowski, KZareba, PSiwek, AKazek, GGluch-Lutwin, MMierzejewski, PBienkowski, PSienkiewicz-Jarosz, HKnez, DWichur, TGobec, SMalawska, B Novel multi-target-directed ligands for Alzheimer's disease: Combining cholinesterase inhibitors and 5-HT Eur J Med Chem124:63-81 (2016) 
 
5-hydroxytryptamine receptor 6
Name:5-hydroxytryptamine receptor 6
Type:G Protein-Coupled Receptor (GPCR)
Mol. Mass.:46968.43
Organism:Homo sapiens (Human)
Description:P50406
Residue:440
BDBM50208215
NameBDBM50208215
Synonyms:CHEMBL3883620
TypeSmall organic molecule
Emp. Form.C32H39N5O2S
Mol. Mass.557.749
SMILESO=S(=O)(c1ccccc1)n1ccc2c(cccc12)N1CCN(CCNC2CCN(Cc3ccccc3)CC2)CC1