Reaction Details
TargetCholinesterase
LigandBDBM8960
Substrate/Competitorn/a
Meas. Tech.ChEMBL_1632481 (CHEMBL3875273)
IC50 1830±n/a nM
Citation Wieckowska, AKolaczkowski, MBucki, AGodyn, JMarcinkowska, MWieckowski, KZareba, PSiwek, AKazek, GGluch-Lutwin, MMierzejewski, PBienkowski, PSienkiewicz-Jarosz, HKnez, DWichur, TGobec, SMalawska, B Novel multi-target-directed ligands for Alzheimer's disease: Combining cholinesterase inhibitors and 5-HT Eur J Med Chem124:63-81 (2016) 
 
Cholinesterase
Name:Cholinesterase
Type:Enzyme
Mol. Mass.:65643.35
Organism:Equus caballus (Horse)
Description:P81908
Residue:574
BDBM8960
NameBDBM8960
Synonyms:(+/-)-2-[(1-benzylpiperidin-4-yl)methyl]-5,6-dimethoxy-indan-1-one Aricept CHEMBL1678 CHEMBL502 Donepezil E2020 US9346818, DPH US9663465, Donepezil
TypeSmall organic molecule
Emp. Form.C24H29NO3
Mol. Mass.379.492
SMILESCOc1cc2CC(CC3CCN(Cc4ccccc4)CC3)C(=O)c2cc1OC