Reaction Details
TargetAcetylcholinesterase
LigandBDBM50208256
Substrate/Competitorn/a
Meas. Tech.ChEMBL_1632485 (CHEMBL3875277)
IC50 9.7±n/a nM
Citation Wieckowska, AKolaczkowski, MBucki, AGodyn, JMarcinkowska, MWieckowski, KZareba, PSiwek, AKazek, GGluch-Lutwin, MMierzejewski, PBienkowski, PSienkiewicz-Jarosz, HKnez, DWichur, TGobec, SMalawska, B Novel multi-target-directed ligands for Alzheimer's disease: Combining cholinesterase inhibitors and 5-HT Eur J Med Chem124:63-81 (2016) 
 
Acetylcholinesterase
Name:Acetylcholinesterase
Type:Enzyme
Mol. Mass.:67792.70
Organism:Homo sapiens (Human)
Description:P22303
Residue:614
BDBM50208256
NameBDBM50208256
Synonyms:CHEMBL3884618
TypeSmall organic molecule
Emp. Form.C34H37N5O2S
Mol. Mass.579.755
SMILESO=S(=O)(c1ccccc1)n1ccc2c(cccc12)N1CCN(CCCNc2c3CCCCc3nc3ccccc23)CC1