Reaction Details
TargetCholinesterase
LigandBDBM50208258
Substrate/Competitorn/a
Meas. Tech.ChEMBL_1632482 (CHEMBL3875274)
IC50 30±n/a nM
Citation Wieckowska, AKolaczkowski, MBucki, AGodyn, JMarcinkowska, MWieckowski, KZareba, PSiwek, AKazek, GGluch-Lutwin, MMierzejewski, PBienkowski, PSienkiewicz-Jarosz, HKnez, DWichur, TGobec, SMalawska, B Novel multi-target-directed ligands for Alzheimer's disease: Combining cholinesterase inhibitors and 5-HT Eur J Med Chem124:63-81 (2016) 
 
Cholinesterase
Name:Cholinesterase
Type:Homotetramer
Mol. Mass.:68422.27
Organism:Homo sapiens (Human)
Description:P06276
Residue:602
BDBM50208258
NameBDBM50208258
Synonyms:CHEMBL3885186
TypeSmall organic molecule
Emp. Form.C37H43N5O2S
Mol. Mass.621.835
SMILESO=S(=O)(c1ccccc1)n1ccc2c(cccc12)N1CCN(CCCCCCNc2c3CCCCc3nc3ccccc23)CC1