Reaction Details
TargetcAMP-specific 3',5'-cyclic phosphodiesterase 4B
LigandBDBM50208311
Substrate/Competitorn/a
Meas. Tech.ChEBML_1632645
IC50 39±n/a nM
Citation Zhou, ZZGe, BCZhong, QPHuang, CCheng, YFYang, XMWang, HTXu, JP Development of highly potent phosphodiesterase 4 inhibitors with anti-neuroinflammation potential: Design, synthesis, and structure-activity relationship study of catecholamides bearing aromatic rings. Eur J Med Chem124:372-379 (2016) 
 
cAMP-specific 3',5'-cyclic phosphodiesterase 4B
Name:cAMP-specific 3',5'-cyclic phosphodiesterase 4B
Type:Protein
Mol. Mass.:83318.87
Organism:Homo sapiens (Human)
Description:Q07343
Residue:736
BDBM50208311
NameBDBM50208311
Synonyms:CHEMBL3885161
TypeSmall organic molecule
Emp. Form.C18H18F2N2O3
Mol. Mass.348.3439
SMILESFC(F)Oc1ccc(cc1OC1CCCC1)C(=O)Nc1cccnc1