Reaction Details
TargetcGMP-dependent 3',5'-cyclic phosphodiesterase
LigandBDBM50208310
Substrate/Competitorn/a
Meas. Tech.ChEMBL_1632641 (CHEMBL3875433)
IC50>100000±n/a nM
Citation Zhou, ZZGe, BCZhong, QPHuang, CCheng, YFYang, XMWang, HTXu, JP Development of highly potent phosphodiesterase 4 inhibitors with anti-neuroinflammation potential: Design, synthesis, and structure-activity relationship study of catecholamides bearing aromatic rings. Eur J Med Chem124:372-379 (2016) 
 
cGMP-dependent 3',5'-cyclic phosphodiesterase
Name:cGMP-dependent 3',5'-cyclic phosphodiesterase
Type:Enzyme Catalytic Domain
Mol. Mass.:105691.58
Organism:Homo sapiens (Human)
Description:O00408
Residue:941
BDBM50208310
NameBDBM50208310
Synonyms:CHEMBL3883753
TypeSmall organic molecule
Emp. Form.C19H18ClF2NO3
Mol. Mass.381.801
SMILESFC(F)Oc1ccc(cc1OC1CCCC1)C(=O)Nc1ccccc1Cl