Reaction Details
TargetcGMP-specific 3',5'-cyclic phosphodiesterase
LigandBDBM50208311
Substrate/Competitorn/a
Meas. Tech.ChEMBL_1632648 (CHEMBL3875440)
IC50>100000±n/a nM
Citation Zhou, ZZGe, BCZhong, QPHuang, CCheng, YFYang, XMWang, HTXu, JP Development of highly potent phosphodiesterase 4 inhibitors with anti-neuroinflammation potential: Design, synthesis, and structure-activity relationship study of catecholamides bearing aromatic rings. Eur J Med Chem124:372-379 (2016) 
 
cGMP-specific 3',5'-cyclic phosphodiesterase
Name:cGMP-specific 3',5'-cyclic phosphodiesterase
Type:Protein
Mol. Mass.:99975.83
Organism:Homo sapiens (Human)
Description:O76074
Residue:875
BDBM50208311
NameBDBM50208311
Synonyms:CHEMBL3885161
TypeSmall organic molecule
Emp. Form.C18H18F2N2O3
Mol. Mass.348.3439
SMILESFC(F)Oc1ccc(cc1OC1CCCC1)C(=O)Nc1cccnc1