Reaction Details
TargetcAMP-specific 3',5'-cyclic phosphodiesterase 4D
LigandBDBM50208314
Substrate/Competitorn/a
Meas. Tech.ChEMBL_1632647 (CHEMBL3875439)
IC50 39±n/a nM
Citation Zhou, ZZGe, BCZhong, QPHuang, CCheng, YFYang, XMWang, HTXu, JP Development of highly potent phosphodiesterase 4 inhibitors with anti-neuroinflammation potential: Design, synthesis, and structure-activity relationship study of catecholamides bearing aromatic rings. Eur J Med Chem124:372-379 (2016) 
 
cAMP-specific 3',5'-cyclic phosphodiesterase 4D
Name:cAMP-specific 3',5'-cyclic phosphodiesterase 4D
Type:Protein
Mol. Mass.:91092.69
Organism:Homo sapiens (Human)
Description:Q08499
Residue:809
BDBM50208314
NameBDBM50208314
Synonyms:CHEMBL3884788
TypeSmall organic molecule
Emp. Form.C18H16ClF2NO3
Mol. Mass.367.774
SMILESFC(F)Oc1ccc(cc1OCC1CC1)C(=O)Nc1ccccc1Cl