Reaction Details
TargetcAMP and cAMP-inhibited cGMP 3',5'-cyclic phosphodiesterase 10A
LigandBDBM50208310
Substrate/Competitorn/a
Meas. Tech.ChEMBL_1632653 (CHEMBL3875445)
IC50>100000±n/a nM
Citation Zhou, ZZGe, BCZhong, QPHuang, CCheng, YFYang, XMWang, HTXu, JP Development of highly potent phosphodiesterase 4 inhibitors with anti-neuroinflammation potential: Design, synthesis, and structure-activity relationship study of catecholamides bearing aromatic rings. Eur J Med Chem124:372-379 (2016) 
 
cAMP and cAMP-inhibited cGMP 3',5'-cyclic phosphodiesterase 10A
Name:cAMP and cAMP-inhibited cGMP 3',5'-cyclic phosphodiesterase 10A
Type:Protein
Mol. Mass.:88412.52
Organism:Homo sapiens (Human)
Description:Q9Y233
Residue:779
BDBM50208310
NameBDBM50208310
Synonyms:CHEMBL3883753
TypeSmall organic molecule
Emp. Form.C19H18ClF2NO3
Mol. Mass.381.801
SMILESFC(F)Oc1ccc(cc1OC1CCCC1)C(=O)Nc1ccccc1Cl