Reaction Details
TargetWD repeat-containing protein 5
LigandBDBM50208355
Substrate/Competitorn/a
Meas. Tech.ChEMBL_1632710 (CHEMBL3875502)
IC50 15±n/a nM
Citation Li, DDChen, WLWang, ZHXie, YYXu, XLJiang, ZYZhang, XJYou, QDGuo, XK High-affinity small molecular blockers of mixed lineage leukemia 1 (MLL1)-WDR5 interaction inhibit MLL1 complex H3K4 methyltransferase activity. Eur J Med Chem124:480-489 (2016) 
 
WD repeat-containing protein 5
Name:WD repeat-containing protein 5
Type:Protein
Mol. Mass.:36597.13
Organism:Homo sapiens (Human)
Description:P61964
Residue:334
BDBM50208355
NameBDBM50208355
Synonyms:CHEMBL3885099
TypeSmall organic molecule
Emp. Form.C28H32ClFN6O2
Mol. Mass.539.044
SMILESCC(N)C(=O)Nc1ccc(cc1)-c1ccc(N2CCN(C)CC2)c(NC(=O)c2cc(N)c(F)c(C)c2Cl)c1