Reaction Details
TargetD(2) dopamine receptor
LigandBDBM50208447
Substrate/Competitorn/a
Meas. Tech.ChEMBL_1632884 (CHEMBL3875676)
Ki 0.500000±n/a nM
Citation Cao, XChen, YZhang, YQiu, YYu, MXu, XLiu, XLiu, BFZhang, G Synthesis and biological evaluation of new 6-hydroxypyridazinone benzisoxazoles: Potential multi-receptor-targeting atypical antipsychotics. Eur J Med Chem124:713-728 (2016) 
 
D(2) dopamine receptor
Name:D(2) dopamine receptor
Type:G Protein-Coupled Receptor (GPCR)
Mol. Mass.:50931.60
Organism:Rattus norvegicus (rat)
Description:P61169
Residue:444
BDBM50208447
NameBDBM50208447
Synonyms:CHEMBL3883955
TypeSmall organic molecule
Emp. Form.C25H23F3N4O3
Mol. Mass.484.4703
SMILESFc1ccc2c(noc2c1)C1CCN(CCCOc2ccc(=O)n(n2)-c2c(F)cccc2F)CC1