Reaction Details
Target5-hydroxytryptamine receptor 2C
LigandBDBM50208446
Substrate/Competitorn/a
Meas. Tech.ChEMBL_1632883 (CHEMBL3875675)
Ki 1.000000±n/a nM
Citation Cao, XChen, YZhang, YQiu, YYu, MXu, XLiu, XLiu, BFZhang, G Synthesis and biological evaluation of new 6-hydroxypyridazinone benzisoxazoles: Potential multi-receptor-targeting atypical antipsychotics. Eur J Med Chem124:713-728 (2016) 
 
5-hydroxytryptamine receptor 2C
Name:5-hydroxytryptamine receptor 2C
Type:Enzyme
Mol. Mass.:51935.10
Organism:Rattus norvegicus (Rat)
Description:P08909
Residue:460
BDBM50208446
NameBDBM50208446
Synonyms:CHEMBL3884161
TypeSmall organic molecule
Emp. Form.C25H23Cl2FN4O3
Mol. Mass.517.38
SMILESFc1ccc2c(noc2c1)C1CCN(CCCOc2ccc(=O)n(n2)-c2cc(Cl)ccc2Cl)CC1